{"text_format":"1","workbook":"xlsx","n_sheets":3,"sheets":["ポケモンしりとり","ポケモン名称マスタ","url"],"not_rendered":{"charts":0,"images":0,"macros":1,"external_links":0,"defined_names":1,"comments":0,"pivot_tables":0},"unopened":[],"bounds":{"document_bytes":16777216,"sheet_cells":100000,"rows_first":2000,"rows_last":500,"rows_between":2000,"halvings":0,"cell_chars":16384,"cell_head_chars":4096},"cells_cut":0,"cells_raw":0,"read":"whole","date_system":"1900"}

{"sheet":"ポケモンしりとり","index":0,"n_rows":3,"n_cols":7,"rows_kept":3,"cut":false,"hidden":false,"merged":[]}
[]
[null,"頭文字","ポケモンの名前は？",null,"ポケモン","タイプ1","タイプ2"]
[null,{"$f":"IFERROR(VLOOKUP(ポケモンしりとり!E3,ポケモン名称マスタ!B:C,2,FALSE),\"\")","v":"ウ"},null,null,"ピカチュウ",{"$f":"IFERROR(IF(VLOOKUP(ポケモンしりとり!E3,ポケモン名称マスタ!B:F,3,FALSE)=0,\"\",VLOOKUP(ポケモンしりとり!E3,ポケモン名称マスタ!B:F,3,FALSE)),\"\")","v":"でんき"},{"$f":"IFERROR(IF(VLOOKUP(ポケモンしりとり!E3,ポケモン名称マスタ!B:F,4,FALSE)=0,\"\",VLOOKUP(ポケモンしりとり!E3,ポケモン名称マスタ!B:F,4,FALSE)),\"\")","v":""}]

{"sheet":"ポケモン名称マスタ","index":1,"n_rows":899,"n_cols":6,"rows_kept":899,"cut":false,"hidden":true,"merged":[]}
["#","なまえ","最後の文字","タイプ1","タイプ2","#"]
[1,"フシギダネ","ネ","くさ","どく",{"$f":"A2","v":1}]
[2,"フシギソウ","ウ","くさ","どく",{"$f":"A3","v":2}]
[3,"フシギバナ","ナ","くさ","どく",3]
[4,"ヒトカゲ","ゲ","ほのお",null,4]
[5,"リザード","ド","ほのお",null,5]
[6,"リザードン","★","ほのお","ひこう",6]
[7,"ゼニガメ","メ","みず",null,7]
[8,"カメール","ル","みず",null,8]
[9,"カメックス","ス","みず",null,9]
[10,"キャタピー","ピ","むし",null,10]
[11,"トランセル","ル","むし",null,11]
[12,"バタフリー","リ","むし","ひこう",12]
[13,"ビードル","ル","むし","どく",13]
[14,"コクーン","★","むし","どく",14]
[15,"スピアー","ア","むし","どく",15]
[16,"ポッポ","ポ","ノーマル","ひこう",16]
[17,"ピジョン","★","ノーマル","ひこう",17]
[18,"ピジョット","ト","ノーマル","ひこう",18]
[19,"コラッタ","タ","ノーマル",null,19]
[20,"ラッタ","タ","ノーマル",null,20]
[21,"オニスズメ","メ","ノーマル","ひこう",21]
[22,"オニドリル","ル","ノーマル","ひこう",22]
[23,"アーボ","ボ","どく",null,23]
[24,"アーボック","ク","どく",null,24]
[25,"ピカチュウ","ウ","でんき",null,25]
[26,"ライチュウ","ウ","でんき",null,26]
[27,"サンド","ド","じめん",null,27]
[28,"サンドパン","★","じめん",null,28]
[29,"ニドラン♀","★","どく",null,29]
[30,"ニドリーナ","ナ","どく",null,30]
[31,"ニドクイン","★","どく","じめん",31]
[32,"ニドラン♂","★","どく",null,32]
[33,"ニドリーノ","ノ","どく",null,33]
[34,"ニドキング","グ","どく","じめん",34]
[35,"ピッピ","ピ","フェアリー",null,35]
[36,"ピクシー","シ","フェアリー",null,36]
[37,"ロコン","★","ほのお",null,37]
[38,"キュウコン","★","ほのお",null,38]
[39,"プリン","★","ノーマル","フェアリー",39]
[40,"プクリン","★","ノーマル","フェアリー",40]
[41,"ズバット","ト","どく","ひこう",41]
[42,"ゴルバット","ト","どく","ひこう",42]
[43,"ナゾノクサ","サ","くさ","どく",43]
[44,"クサイハナ","ナ","くさ","どく",44]
[45,"ラフレシア","ア","くさ","どく",45]
[46,"パラス","ス","むし","くさ",46]
[47,"パラセクト","ト","むし","くさ",47]
[48,"コンパン","★","むし","どく",48]
[49,"モルフォン","★","むし","どく",49]
[50,"ディグダ","ダ","じめん",null,50]
[51,"ダグトリオ","オ","じめん",null,51]
[52,"ニャース","ス","ノーマル",null,52]
[53,"ペルシアン","★","ノーマル",null,53]
[54,"コダック","ク","みず",null,54]
[55,"ゴルダック","ク","みず",null,55]
[56,"マンキー","キ","かくとう",null,56]
[57,"オコリザル","ル","かくとう",null,57]
[58,"ガーディ","イ","ほのお",null,58]
[59,"ウインディ","イ","ほのお",null,59]
[60,"ニョロモ","モ","みず",null,60]
[61,"ニョロゾ","ゾ","みず",null,61]
[62,"ニョロボン","★","みず","かくとう",62]
[63,"ケーシィ","イ","エスパー",null,63]
[64,"ユンゲラー","ラ","エスパー",null,64]
[65,"フーディン","★","エスパー",null,65]
[66,"ワンリキー","キ","かくとう",null,{"$f":"A67","v":66}]
[67,"ゴーリキー","キ","かくとう",null,67]
[68,"カイリキー","キ","かくとう",null,68]
[69,"マダツボミ","ミ","くさ","どく",69]
[70,"ウツドン","★","くさ","どく",70]
[71,"ウツボット","ト","くさ","どく",71]
[72,"メノクラゲ","ゲ","みず","どく",72]
[73,"ドククラゲ","ゲ","みず","どく",73]
[74,"イシツブテ","テ","いわ","じめん",74]
[75,"ゴローン","★","いわ","じめん",75]
[76,"ゴローニャ","ヤ","いわ","じめん",76]
[77,"ポニータ","タ","ほのお",null,77]
[78,"ギャロップ","プ","ほのお",null,78]
[79,"ヤドン","★","みず","エスパー",79]
[80,"ヤドラン","★","みず","エスパー",80]
[81,"コイル","ル","でんき","はがね",81]
[82,"レアコイル","ル","でんき","はがね",82]
[83,"カモネギ","ギ","ノーマル","ひこう",83]
[84,"ドードー","ド","ノーマル","ひこう",84]
[85,"ドードリオ","オ","ノーマル","ひこう",85]
[86,"パウワウ","ウ","みず",null,86]
[87,"ジュゴン","★","みず","こおり",87]
[88,"ベトベター","タ","どく",null,88]
[89,"ベトベトン","★","どく",null,89]
[90,"シェルダー","ダ","みず",null,90]
[91,"パルシェン","★","みず","こおり",91]
[92,"ゴース","ス","ゴースト","どく",92]
[93,"ゴースト","ト","ゴースト","どく",93]
[94,"ゲンガー","ガ","ゴースト","どく",94]
[95,"イワーク","ク","いわ","じめん",95]
[96,"スリープ","プ","エスパー",null,96]
[97,"スリーパー","パ","エスパー",null,97]
[98,"クラブ","ブ","みず",null,98]
[99,"キングラー","ラ","みず",null,99]
[100,"ビリリダマ","マ","でんき",null,100]
[101,"マルマイン","★","でんき",null,101]
[102,"タマタマ","マ","くさ","エスパー",102]
[103,"ナッシー","シ","くさ","エスパー",103]
[104,"カラカラ","ラ","じめん",null,104]
[105,"ガラガラ","ラ","じめん",null,105]
[106,"サワムラー","ラ","かくとう",null,106]
[107,"エビワラー","ラ","かくとう",null,107]
[108,"ベロリンガ","ガ","ノーマル",null,108]
[109,"ドガース","ス","どく",null,109]
[110,"マタドガス","ス","どく",null,110]
[111,"サイホーン","★","じめん","いわ",111]
[112,"サイドン","★","じめん","いわ",112]
[113,"ラッキー","キ","ノーマル",null,113]
[114,"モンジャラ","ラ","くさ",null,114]
[115,"ガルーラ","ラ","ノーマル",null,115]
[116,"タッツー","ツ","みず",null,116]
[117,"シードラ","ラ","みず",null,117]
[118,"トサキント","ト","みず",null,118]
[119,"アズマオウ","ウ","みず",null,119]
[120,"ヒトデマン","★","みず",null,120]
[121,"スターミー","ミ","みず","エスパー",121]
[122,"バリヤード","ド","エスパー","フェアリー",122]
[123,"ストライク","ク","むし","ひこう",123]
[124,"ルージュラ","ラ","こおり","エスパー",124]
[125,"エレブー","ブ","でんき",null,125]
[126,"ブーバー","バ","ほのお",null,126]
[127,"カイロス","ス","むし",null,127]
[128,"ケンタロス","ス","ノーマル",null,128]
[129,"コイキング","グ","みず",null,129]
[130,"ギャラドス","ス","みず","ひこう",{"$f":"A131","v":130}]
[131,"ラプラス","ス","みず","こおり",131]
[132,"メタモン","★","ノーマル",null,132]
[133,"イーブイ","イ","ノーマル",null,133]
[134,"シャワーズ","ズ","みず",null,134]
[135,"サンダース","ス","でんき",null,135]
[136,"ブースター","タ","ほのお",null,136]
[137,"ポリゴン","★","ノーマル",null,137]
[138,"オムナイト","ト","いわ","みず",138]
[139,"オムスター","タ","いわ","みず",139]
[140,"カブト","ト","いわ","みず",140]
[141,"カブトプス","ス","いわ","みず",141]
[142,"プテラ","ラ","いわ","ひこう",142]
[143,"カビゴン","★","ノーマル",null,143]
[144,"フリーザー","ザ","こおり","ひこう",144]
[145,"サンダー","ダ","でんき","ひこう",145]
[146,"ファイヤー","ヤ","ほのお","ひこう",146]
[147,"ミニリュウ","ウ","ドラゴン",null,147]
[148,"ハクリュー","ユ","ドラゴン",null,148]
[149,"カイリュー","ユ","ドラゴン","ひこう",149]
[150,"ミュウツー","ツ","エスパー",null,150]
[151,"ミュウ","ウ","エスパー",null,151]
[152,"チコリータ","タ","くさ",null,152]
[153,"ベイリーフ","フ","くさ",null,153]
[154,"メガニウム","ム","くさ",null,154]
[155,"ヒノアラシ","シ","ほのお",null,155]
[156,"マグマラシ","シ","ほのお",null,156]
[157,"バクフーン","★","ほのお",null,157]
[158,"ワニノコ","コ","みず",null,158]
[159,"アリゲイツ","ツ","みず",null,159]
[160,"オーダイル","ル","みず",null,160]
[161,"オタチ","チ","ノーマル",null,161]
[162,"オオタチ","チ","ノーマル",null,162]
[163,"ホーホー","ホ","ノーマル","ひこう",163]
[164,"ヨルノズク","ク","ノーマル","ひこう",164]
[165,"レディバ","バ","むし","ひこう",165]
[166,"レディアン","★","むし","ひこう",166]
[167,"イトマル","ル","むし","どく",167]
[168,"アリアドス","ス","むし","どく",168]
[169,"クロバット","ト","どく","ひこう",169]
[170,"チョンチー","チ","みず","でんき",170]
[171,"ランターン","★","みず","でんき",171]
[172,"ピチュー","ユ","でんき",null,172]
[173,"ピィ","イ","フェアリー",null,173]
[174,"ププリン","★","ノーマル","フェアリー",174]
[175,"トゲピー","ピ","フェアリー",null,175]
[176,"トゲチック","ク","フェアリー","ひこう",176]
[177,"ネイティ","イ","エスパー","ひこう",177]
[178,"ネイティオ","オ","エスパー","ひこう",178]
[179,"メリープ","プ","でんき",null,179]
[180,"モココ","コ","でんき",null,180]
[181,"デンリュウ","ウ","でんき",null,181]
[182,"キレイハナ","ナ","くさ",null,182]
[183,"マリル","ル","みず","フェアリー",183]
[184,"マリルリ","リ","みず","フェアリー",184]
[185,"ウソッキー","キ","いわ",null,185]
[186,"ニョロトノ","ノ","みず",null,186]
[187,"ハネッコ","コ","くさ","ひこう",187]
[188,"ポポッコ","コ","くさ","ひこう",188]
[189,"ワタッコ","コ","くさ","ひこう",189]
[190,"エイパム","ム","ノーマル",null,190]
[191,"ヒマナッツ","ツ","くさ",null,191]
[192,"キマワリ","リ","くさ",null,192]
[193,"ヤンヤンマ","マ","むし","ひこう",193]
[194,"ウパー","パ","みず","じめん",{"$f":"A195","v":194}]
[195,"ヌオー","オ","みず","じめん",195]
[196,"エーフィ","イ","エスパー",null,196]
[197,"ブラッキー","キ","あく",null,197]
[198,"ヤミカラス","ス","あく","ひこう",198]
[199,"ヤドキング","グ","みず","エスパー",199]
[200,"ムウマ","マ","ゴースト",null,200]
[201,"アンノーン","★","エスパー",null,201]
[202,"ソーナンス","ス","エスパー",null,202]
[203,"キリンリキ","キ","ノーマル","エスパー",203]
[204,"クヌギダマ","マ","むし",null,204]
[205,"フォレトス","ス","むし","はがね",205]
[206,"ノコッチ","チ","ノーマル",null,206]
[207,"グライガー","ガ","じめん","ひこう",207]
[208,"ハガネール","ル","はがね","じめん",208]
[209,"ブルー","ル","フェアリー",null,209]
[210,"グランブル","ル","フェアリー",null,210]
[211,"ハリーセン","★","みず","どく",211]
[212,"ハッサム","ム","むし","はがね",212]
[213,"ツボツボ","ボ","むし","いわ",213]
[214,"ヘラクロス","ス","むし","かくとう",214]
[215,"ニューラ","ラ","あく","こおり",215]
[216,"ヒメグマ","マ","ノーマル",null,216]
[217,"リングマ","マ","ノーマル",null,217]
[218,"マグマッグ","グ","ほのお",null,218]
[219,"マグカルゴ","ゴ","ほのお","いわ",219]
[220,"ウリムー","ム","こおり","じめん",220]
[221,"イノムー","ム","こおり","じめん",221]
[222,"サニーゴ","ゴ","みず","いわ",222]
[223,"テッポウオ","オ","みず",null,223]
[224,"オクタン","★","みず",null,224]
[225,"デリバード","ド","こおり","ひこう",225]
[226,"マンタイン","★","みず","ひこう",226]
[227,"エアームド","ド","はがね","ひこう",227]
[228,"デルビル","ル","あく","ほのお",228]
[229,"ヘルガー","ガ","あく","ほのお",229]
[230,"キングドラ","ラ","みず","ドラゴン",230]
[231,"ゴマゾウ","ウ","じめん",null,231]
[232,"ドンファン","★","じめん",null,232]
[233,"ポリゴン2","ツ","ノーマル",null,233]
[234,"オドシシ","シ","ノーマル",null,234]
[235,"ドーブル","ル","ノーマル",null,235]
[236,"バルキー","キ","かくとう",null,236]
[237,"カポエラー","ラ","かくとう",null,237]
[238,"ムチュール","ル","こおり","エスパー",238]
[239,"エレキッド","ド","でんき",null,239]
[240,"ブビィ","イ","ほのお",null,240]
[241,"ミルタンク","ク","ノーマル",null,241]
[242,"ハピナス","ス","ノーマル",null,242]
[243,"ライコウ","ウ","でんき",null,243]
[244,"エンテイ","イ","ほのお",null,244]
[245,"スイクン","★","みず",null,245]
[246,"ヨーギラス","ス","いわ","じめん",246]
[247,"サナギラス","ス","いわ","じめん",247]
[248,"バンギラス","ス","いわ","あく",248]
[249,"ルギア","ア","エスパー","ひこう",249]
[250,"ホウオウ","ウ","ほのお","ひこう",250]
[251,"セレビィ","イ","エスパー","くさ",251]
[252,"キモリ","リ","くさ",null,252]
[253,"ジュプトル","ル","くさ",null,253]
[254,"ジュカイン","★","くさ",null,254]
[255,"アチャモ","モ","ほのお",null,255]
[256,"ワカシャモ","モ","ほのお","かくとう",256]
[257,"バシャーモ","モ","ほのお","かくとう",257]
[258,"ミズゴロウ","ウ","みず",null,{"$f":"A259","v":258}]
[259,"ヌマクロー","ロ","みず","じめん",259]
[260,"ラグラージ","ジ","みず","じめん",260]
[261,"ポチエナ","ナ","あく",null,261]
[262,"グラエナ","ナ","あく",null,262]
[263,"ジグザグマ","マ","ノーマル",null,263]
[264,"マッスグマ","マ","ノーマル",null,264]
[265,"ケムッソ","ソ","むし",null,265]
[266,"カラサリス","ス","むし",null,266]
[267,"アゲハント","ト","むし","ひこう",267]
[268,"マユルド","ド","むし",null,268]
[269,"ドクケイル","ル","むし","どく",269]
[270,"ハスボー","ボ","みず","くさ",270]
[271,"ハスブレロ","ロ","みず","くさ",271]
[272,"ルンパッパ","パ","みず","くさ",272]
[273,"タネボー","ボ","くさ",null,273]
[274,"コノハナ","ナ","くさ","あく",274]
[275,"ダーテング","グ","くさ","あく",275]
[276,"スバメ","メ","ノーマル","ひこう",276]
[277,"オオスバメ","メ","ノーマル","ひこう",277]
[278,"キャモメ","メ","みず","ひこう",278]
[279,"ペリッパー","パ","みず","ひこう",279]
[280,"ラルトス","ス","エスパー","フェアリー",280]
[281,"キルリア","ア","エスパー","フェアリー",281]
[282,"サーナイト","ト","エスパー","フェアリー",282]
[283,"アメタマ","マ","むし","みず",283]
[284,"アメモース","ス","むし","ひこう",284]
[285,"キノココ","コ","くさ",null,285]
[286,"キノガッサ","サ","くさ","かくとう",286]
[287,"ナマケロ","ロ","ノーマル",null,287]
[288,"ヤルキモノ","ノ","ノーマル",null,288]
[289,"ケッキング","グ","ノーマル",null,289]
[290,"ツチニン","★","むし","じめん",290]
[291,"テッカニン","★","むし","ひこう",291]
[292,"ヌケニン","★","むし","ゴースト",292]
[293,"ゴニョニョ","ヨ","ノーマル",null,293]
[294,"ドゴーム","ム","ノーマル",null,294]
[295,"バクオング","グ","ノーマル",null,295]
[296,"マクノシタ","タ","かくとう",null,296]
[297,"ハリテヤマ","マ","かくとう",null,297]
[298,"ルリリ","リ","ノーマル","フェアリー",298]
[299,"ノズパス","ス","いわ",null,299]
[300,"エネコ","コ","ノーマル",null,300]
[301,"エネコロロ","ロ","ノーマル",null,301]
[302,"ヤミラミ","ミ","あく","ゴースト",302]
[303,"クチート","ト","はがね","フェアリー",303]
[304,"ココドラ","ラ","はがね","いわ",304]
[305,"コドラ","ラ","はがね","いわ",305]
[306,"ボスゴドラ","ラ","はがね","いわ",306]
[307,"アサナン","★","かくとう","エスパー",307]
[308,"チャーレム","ム","かくとう","エスパー",308]
[309,"ラクライ","イ","でんき",null,309]
[310,"ライボルト","ト","でんき",null,310]
[311,"プラスル","ル","でんき",null,311]
[312,"マイナン","★","でんき",null,312]
[313,"バルビート","ト","むし",null,313]
[314,"イルミーゼ","ゼ","むし",null,314]
[315,"ロゼリア","ア","くさ","どく",315]
[316,"ゴクリン","★","どく",null,316]
[317,"マルノーム","ム","どく",null,317]
[318,"キバニア","ア","みず","あく",318]
[319,"サメハダー","ダ","みず","あく",319]
[320,"ホエルコ","コ","みず",null,320]
[321,"ホエルオー","オ","みず",null,321]
[322,"ドンメル","ル","ほのお","じめん",{"$f":"A323","v":322}]
[323,"バクーダ","ダ","ほのお","じめん",323]
[324,"コータス","ス","ほのお",null,324]
[325,"バネブー","ブ","エスパー",null,325]
[326,"ブーピッグ","グ","エスパー",null,326]
[327,"パッチール","ル","ノーマル",null,327]
[328,"ナックラー","ラ","じめん",null,328]
[329,"ビブラーバ","バ","じめん","ドラゴン",329]
[330,"フライゴン","★","じめん","ドラゴン",330]
[331,"サボネア","ア","くさ",null,331]
[332,"ノクタス","ス","くさ","あく",332]
[333,"チルット","ト","ノーマル","ひこう",333]
[334,"チルタリス","ス","ドラゴン","ひこう",334]
[335,"ザングース","ス","ノーマル",null,335]
[336,"ハブネーク","ク","どく",null,336]
[337,"ルナトーン","★","いわ","エスパー",337]
[338,"ソルロック","ク","いわ","エスパー",338]
[339,"ドジョッチ","チ","みず","じめん",339]
[340,"ナマズン","★","みず","じめん",340]
[341,"ヘイガニ","ニ","みず",null,341]
[342,"シザリガー","ガ","みず","あく",342]
[343,"ヤジロン","★","じめん","エスパー",343]
[344,"ネンドール","ル","じめん","エスパー",344]
[345,"リリーラ","ラ","いわ","くさ",345]
[346,"ユレイドル","ル","いわ","くさ",346]
[347,"アノプス","ス","いわ","むし",347]
[348,"アーマルド","ド","いわ","むし",348]
[349,"ヒンバス","ス","みず",null,349]
[350,"ミロカロス","ス","みず",null,350]
[351,"ポワルン","★","ノーマル",null,351]
[352,"カクレオン","★","ノーマル",null,352]
[353,"カゲボウズ","ズ","ゴースト",null,353]
[354,"ジュペッタ","タ","ゴースト",null,354]
[355,"ヨマワル","ル","ゴースト",null,355]
[356,"サマヨール","ル","ゴースト",null,356]
[357,"トロピウス","ス","くさ","ひこう",357]
[358,"チリーン","★","エスパー",null,358]
[359,"アブソル","ル","あく",null,359]
[360,"ソーナノ","ノ","エスパー",null,360]
[361,"ユキワラシ","シ","こおり",null,361]
[362,"オニゴーリ","リ","こおり",null,362]
[363,"タマザラシ","シ","こおり","みず",363]
[364,"トドグラー","ラ","こおり","みず",364]
[365,"トドゼルガ","ガ","こおり","みず",365]
[366,"パールル","ル","みず",null,366]
[367,"ハンテール","ル","みず",null,367]
[368,"サクラビス","ス","みず",null,368]
[369,"ジーランス","ス","みず","いわ",369]
[370,"ラブカス","ス","みず",null,370]
[371,"タツベイ","イ","ドラゴン",null,371]
[372,"コモルー","ル","ドラゴン",null,372]
[373,"ボーマンダ","ダ","ドラゴン","ひこう",373]
[374,"ダンバル","ル","はがね","エスパー",374]
[375,"メタング","グ","はがね","エスパー",375]
[376,"メタグロス","ス","はがね","エスパー",376]
[377,"レジロック","ク","いわ",null,377]
[378,"レジアイス","ス","こおり",null,378]
[379,"レジスチル","ル","はがね",null,379]
[380,"ラティアス","ス","ドラゴン","エスパー",380]
[381,"ラティオス","ス","ドラゴン","エスパー",381]
[382,"カイオーガ","ガ","みず",null,382]
[383,"グラードン","★","じめん",null,383]
[384,"レックウザ","ザ","ドラゴン","ひこう",384]
[385,"ジラーチ","チ","はがね","エスパー",385]
[386,"デオキシス","ス","エスパー",null,{"$f":"A387","v":386}]
[387,"ナエトル","ル","くさ",null,387]
[388,"ハヤシガメ","メ","くさ",null,388]
[389,"ドダイトス","ス","くさ","じめん",389]
[390,"ヒコザル","ル","ほのお",null,390]
[391,"モウカザル","ル","ほのお","かくとう",391]
[392,"ゴウカザル","ル","ほのお","かくとう",392]
[393,"ポッチャマ","マ","みず",null,393]
[394,"ポッタイシ","シ","みず",null,394]
[395,"エンペルト","ト","みず","はがね",395]
[396,"ムックル","ル","ノーマル","ひこう",396]
[397,"ムクバード","ド","ノーマル","ひこう",397]
[398,"ムクホーク","ク","ノーマル","ひこう",398]
[399,"ビッパ","パ","ノーマル",null,399]
{"$rows_left_out":500}
{"sheet":"url","index":2,"n_rows":1,"n_cols":1,"rows_kept":1,"cut":false,"hidden":true,"merged":[]}
[{"$f":"\"https://zukan.pokemon.co.jp/detail/\"&TEXT(VLOOKUP(ポケモンしりとり!$E$3,ポケモン名称マスタ!B:F,5,FALSE),\"000\")","v":"https://zukan.pokemon.co.jp/detail/025"}]